Benzoyl(pentacarbonyl)manganese

Phase change data

Data compiled by: William E. Acree, Jr., James S. Chickos

Quantity Value Units Method Reference Comment
Δsub123. ± 3.kJ/molCConnor, Zafarani-Moattar, et al., 1982

References

Connor, Zafarani-Moattar, et al., 1982
Connor, Joseph A.; Zafarani-Moattar, Mohamed T.; Bickerton, James; El Saied, Nabila I.; Suradi, Sukiman; Carson, Ronald; Al Takhin, Ghassan; Skinner, Henry A., Enthalpy of formation of acyl-, alkyl- and hydridopentacarbonyl-manganese complexes. The enthalpy contributions of manganese-hydrogen and manganese-carbon bonds in these molecules. Thermochemical aspects of models in Fischer-Tropsch reactions, Organometallics, 1982, 1, 9, 1166-1174, https://doi.org/10.1021/om00069a011 . [all data]