Tetradecane, 2-methyl-

Phase change data

Data compiled as indicated in comments:
TRC - Thermodynamics Research Center, NIST Boulder Laboratories, Chris Muzny director
AC - William E. Acree, Jr., James S. Chickos

Quantity Value Units Method Reference Comment
Tfus264.3KN/ATerres, Gebert, et al., 1954Uncertainty assigned by TRC = 0.7 K; TRC
Tfus264.9KN/ALunshof, Van Steenis, et al., 1947Uncertainty assigned by TRC = 0.5 K; TRC

Enthalpy of vaporization

ΔvapH (kJ/mol) Temperature (K) Method Reference Comment
58.8417.AStephenson and Malanowski, 1987Based on data from 402. - 537. K.; AC

In addition to the Thermodynamics Research Center (TRC) data available from this site, much more physical and chemical property data is available from the following TRC products:

Kovats' RI, non-polar column, isothermal

View large format table.

Column type Active phase Temperature (C) I Reference Comment
CapillarySE-30100.1462.Shlyakhov, Koreshkova, et al., 1975
CapillaryApiezon L100.1461.Shlyakhov, Koreshkova, et al., 1975

Kovats' RI, non-polar column, temperature ramp

View large format table.

Column type Active phase I Reference Comment
CapillaryCP Sil 8 CB1480.Schwob, Bessiere, et al., 200430. m/0.25 mm/0.25 μm, H2, 50. C @ 2. min, 3. K/min; Tend: 220. C

Van Den Dool and Kratz RI, non-polar column, temperature ramp

View large format table.

Column type Active phase I Reference Comment
CapillaryCross-Linked Methylsilicone1465.Khorasheh, Gray, et al., 19895. K/min; Tstart: 40. C; Tend: 300. C
CapillaryUltra-11464.89Haynes and Pitzer, 198550. m/0.22 mm/0.33 μm, He, 1. K/min; Tstart: -30. C; Tend: 240. C
CapillaryUltra-11464.87Haynes and Pitzer, 198550. m/0.22 mm/0.33 μm, He, 2. K/min; Tstart: -30. C; Tend: 240. C
CapillaryUltra-11464.95Haynes and Pitzer, 198550. m/0.22 mm/0.33 μm, He, 3. K/min; Tstart: -30. C; Tend: 240. C
CapillaryUltra-21463.92Haynes and Pitzer, 198550. m/0.22 mm/0.33 μm, He, 1. K/min; Tstart: -30. C; Tend: 240. C
CapillaryUltra-21464.09Haynes and Pitzer, 198550. m/0.22 mm/0.33 μm, He, 2. K/min; Tstart: -30. C; Tend: 240. C
CapillaryUltra-21464.24Haynes and Pitzer, 198550. m/0.22 mm/0.33 μm, He, 3. K/min; Tstart: -30. C; Tend: 240. C

Van Den Dool and Kratz RI, non-polar column, custom temperature program

View large format table.

Column type Active phase I Reference Comment
CapillaryDB-51467.Zaikin and Borisov, 2002He; Column length: 30. m; Column diameter: 0.25 mm; Program: 30C => 5K/min=120C => 10C/min => 270C

Van Den Dool and Kratz RI, polar column, temperature ramp

View large format table.

Column type Active phase I Reference Comment
CapillarySupelcowax-101483.Moreira, Trugo, et al., 200230. m/0.25 mm/0.25 μm, He, 3. K/min, 230. C @ 30. min; Tstart: 50. C

Normal alkane RI, non-polar column, temperature ramp

View large format table.

Column type Active phase I Reference Comment
CapillaryHP-5 MS1461.Kotowska, Zalikowski, et al., 201230. m/0.25 mm/0.25 μm, Helium, 35. C @ 5. min, 3. K/min, 300. C @ 15. min
CapillaryVF-5 MS1460.Srisajjalerwaja, Apichartsrangkoon, et al., 201260. m/0.25 mm/0.25 μm, Helium, 40. C @ 2. min, 4. K/min; Tend: 250. C
CapillaryHP-5 MS1463.Radulovic, Blagojevic, et al., 201030. m/0.25 mm/0.25 μm, Helium, 5. K/min, 290. C @ 10. min; Tstart: 70. C
CapillaryOV-11465.4Krkosova, Kubinec, et al., 2007100. m/0.32 mm/0.25 μm, Helium, 5. K/min, 310. C @ 5. min; Tstart: 30. C
CapillaryHP-51462.Pino, Sauri-Duch, et al., 200630. m/0.25 mm/0.25 μm, H2, 50. C @ 2. min, 4. K/min, 280. C @ 10. min
CapillaryHP-51454.Utsunomia, Kawata, et al., 200530. m/0.32 mm/0.25 μm, Helium, 4. K/min, 300. C @ 5. min; Tstart: 40. C
CapillaryDB-51457.Dhanda, Pegg, et al., 200360. m/0.25 mm/0.25 μm, He, 35. C @ 2. min, 5. K/min, 280. C @ 4. min

Normal alkane RI, non-polar column, custom temperature program

View large format table.

Column type Active phase I Reference Comment
CapillaryHP-5 MS1465.Kotowska, Zalikowski, et al., 201230. m/0.25 mm/0.25 μm, Helium; Program: not specified
CapillarySqualane1461.Petrov, 1984Program: not specified
CapillaryApiezon L1461.Shlyakhov, 1984Program: not specified
CapillaryOV-1, SE-30, Methyl silicone, SP-2100, OV-101, DB-1, etc.1462.Waggott and Davies, 1984Hydrogen; Column length: 50. m; Column diameter: 0.32 mm; Program: not specified

References

Terres, Gebert, et al., 1954
Terres, E.; Gebert, F.; Fischer, D.; Modak, G., Brennst.-Chem., 1954, 35, 263-9. [all data]

Lunshof, Van Steenis, et al., 1947
Lunshof; Van Steenis, J.; Waterman, Recl. Trav. Chim. Pays-Bas, 1947, 66, 348. [all data]

Stephenson and Malanowski, 1987
Stephenson, Richard M.; Malanowski, Stanislaw, Handbook of the Thermodynamics of Organic Compounds, 1987, https://doi.org/10.1007/978-94-009-3173-2 . [all data]

Shlyakhov, Koreshkova, et al., 1975
Shlyakhov, A.F.; Koreshkova, R.I.; Telkova, M.S., Gas Chromatography of Isoprenoid Alkanes, J. Chromatogr., 1975, 104, 2, 337-349, https://doi.org/10.1016/S0021-9673(00)91857-0 . [all data]

Schwob, Bessiere, et al., 2004
Schwob, I.; Bessiere, J.-M.; Masotti, V.; Viano, J., Changes in essential oil composition in Saint John's wort (Hypericum perforatum L.) aerial parts during its phenological cycle, Biochem. Syst. Ecol., 2004, 32, 8, 735-745, https://doi.org/10.1016/j.bse.2003.12.005 . [all data]

Khorasheh, Gray, et al., 1989
Khorasheh, F.; Gray, M.R.; Selucky, M.L., Correlation for Kováts retention index of C9-C26 monoalkyl and polymethyl alkanes and alkenes, J. Chromatogr., 1989, 481, 1-16, https://doi.org/10.1016/S0021-9673(01)96747-0 . [all data]

Haynes and Pitzer, 1985
Haynes, P.C., Jr.; Pitzer, E.W., Disengaging solutes in shale- and petroleum-derived jet fuels by altering GC programmed temperature rates, J. Hi. Res. Chromatogr. Chromatogr. Comm., 1985, 8, 5, 230-242, https://doi.org/10.1002/jhrc.1240080504 . [all data]

Zaikin and Borisov, 2002
Zaikin, V.G.; Borisov, R.S., Chromatographic-mass spectrometric analysis of Fishcer-Tropsch synthesis products, J. Anal. Chem. USSR (Engl. Transl.), 2002, 57, 6, 544-551. [all data]

Moreira, Trugo, et al., 2002
Moreira, R.F.A.; Trugo, L.C.; Pietroluongo, M.; de Maria, C.A.B., Flavor composition of cashew (Anacardium occidentale) and marmeleiro (Croton species) honeys, J. Agric. Food Chem., 2002, 50, 26, 7616-7621, https://doi.org/10.1021/jf020464b . [all data]

Kotowska, Zalikowski, et al., 2012
Kotowska, U.; Zalikowski, M.; Isidorov, V.A., HS-SPME/GC-MS analysis of volatile and semi-volatile organic compounds emitted from municipal sewage sludge, Environ. Monit. Asses., 2012, 184, 5, 2893-2907, https://doi.org/10.1007/s10661-011-2158-8 . [all data]

Srisajjalerwaja, Apichartsrangkoon, et al., 2012
Srisajjalerwaja, S.; Apichartsrangkoon, A.; Chaikham, P.; Chakrabandhu, Y.; Pathomrungsiyounggul, P.; Leksawasdi, N.; Supraditareporn, W.; Hirun, S., Color, capsaicin and volatile components of baked thai green chili (Capsicum anmuum Linn. var. Jak Ka Pat), J. Agricultural Sci., 2012, 4, 12, 75-84. [all data]

Radulovic, Blagojevic, et al., 2010
Radulovic, N.; Blagojevic, P.; Palic, R., Comparative study of the leaf volatiles of Arctostaphylos uva-ursi (L.) Spreng. and Vaccinium vitis-idaea L. (Ericaceae), Molecules, 2010, 15, 9, 6168-6185, https://doi.org/10.3390/molecules15096168 . [all data]

Krkosova, Kubinec, et al., 2007
Krkosova, Z.; Kubinec, R.; Addova, G.; Jurdakova, H.; Blasko, J.; Ostrovsky, I.; Sojak, L., Gas chromatographic - mass spectrometric characterization of monomethylalkanes from fuel diesel, Petroleum Coal, 2007, 49, 3, 51-62. [all data]

Pino, Sauri-Duch, et al., 2006
Pino, J.; Sauri-Duch, E.; Marbot, R., Changes in volatile compounds of Habanero chile pepper (Capsicum chinense Jack. cv. Habanero) at two ripening stages, Food Chem., 2006, 94, 3, 394-398, https://doi.org/10.1016/j.foodchem.2004.11.040 . [all data]

Utsunomia, Kawata, et al., 2005
Utsunomia, H.; Kawata, J.; Chanoki, W.; Shirakawa, N.; Miyazawa, M., Components of Essential Oil from Woods of Prunus mume Sieb. at Zucc., J. Oleo Sci., 2005, 54, 11, 609-612, https://doi.org/10.5650/jos.54.609 . [all data]

Dhanda, Pegg, et al., 2003
Dhanda, J.S.; Pegg, R.B.; Shand, P.J., Saskatchewan specialty livestock value-added program - Saskatchewan agri-food innovation fund (AFIF) Project #98000016, 2003, retrieved from http://www.agr.gov.sk.ca/afif/Projects/19980016.pdf. [all data]

Petrov, 1984
Petrov, A.A., Hydrocarbons of petroleum, Nauka (publishing house), Moscow, 1984, 263. [all data]

Shlyakhov, 1984
Shlyakhov, A.F., Gas chromatography in organic geochemistry, Nedra, Moscow, 1984, 221. [all data]

Waggott and Davies, 1984
Waggott, A.; Davies, I.W., Identification of organic pollutants using linear temperature programmed retention indices (LTPRIs) - Part II, 1984, retrieved from http://dwi.defra.gov.uk/research/completed-research/reports/dwi0383.pdf. [all data]