2-Methyldocosane

Normal alkane RI, non-polar column, temperature ramp

Data compiled by: NIST Mass Spectrometry Data Center, William E. Wallace, director

Column type CapillaryCapillaryCapillary
Active phase BP-1BP-1OV-1
Column length (m) 30.30.100.
Carrier gas HeliumHeliumHelium
Substrate
Column diameter (mm) 0.220.220.32
Phase thickness (μm) 0.250.250.25
Tstart (C) 40.40.30.
Tend (C) 290.290.310.
Heat rate (K/min) 5.5.5.
Initial hold (min)
Final hold (min) 15.15.5.
I 2264.2265.2265.1
ReferenceMutis, Parra, et al., 2009Mutis, Parra, et al., 2009Krkosova, Kubinec, et al., 2007
Comment MSDC-RI MSDC-RI MSDC-RI

Van Den Dool and Kratz RI, non-polar column, custom temperature program

Data compiled by: NIST Mass Spectrometry Data Center, William E. Wallace, director

Column type Capillary
Active phase DB-5
Column length (m) 30.
Carrier gas He
Substrate
Column diameter (mm) 0.25
Phase thickness (μm)
Program 30C => 5K/min=120C => 10C/min => 270C
I 2265.
ReferenceZaikin and Borisov, 2002
Comment MSDC-RI

References

Mutis, Parra, et al., 2009
Mutis, A.; Parra, L.; Palma, R.; Pardo, F.; Perich, F.; Quiroz, A., Evidence of contact pheromone use in mating behavior of the raspberry weevil (Coleoptera: Corculionidae), Environ. Entomol., 2009, 38, 1, 192-197, https://doi.org/10.1603/022.038.0124 . [all data]

Krkosova, Kubinec, et al., 2007
Krkosova, Z.; Kubinec, R.; Addova, G.; Jurdakova, H.; Blasko, J.; Ostrovsky, I.; Sojak, L., Gas chromatographic - mass spectrometric characterization of monomethylalkanes from fuel diesel, Petroleum Coal, 2007, 49, 3, 51-62. [all data]