Nonacosane, 2-methyl-

Phase change data

Data compiled by: William E. Acree, Jr., James S. Chickos

Enthalpy of vaporization

ΔvapH (kJ/mol) Temperature (K) Reference Comment
116.8476.Dykyj, Svoboda, et al., 1999Based on data from 461. - 718. K.

Van Den Dool and Kratz RI, non-polar column, temperature ramp

View large format table.

Column type Active phase I Reference Comment
CapillaryUltra-12958.Nelson, Adams, et al., 2003150. C @ 4. min, 4. K/min, 320. C @ 30. min; Column length: 12. m; Column diameter: 0.2 mm

Van Den Dool and Kratz RI, non-polar column, custom temperature program

View large format table.

Column type Active phase I Reference Comment
CapillaryHP-5MS2960.6Andriamaharavo, 201430. m/0.25 mm/0.25 μm, He; Program: 60C (1 min) => 5 C/min => 210C => 10 C/min => 280C (15 min)
CapillaryDB-12965.Sutton and Carlson, 1993He; Column length: 30. m; Column diameter: 0.25 mm; Program: 60C => 20C/min => 230C => 5C/min => 330C

Normal alkane RI, non-polar column, temperature ramp

View large format table.

Column type Active phase I Reference Comment
CapillaryOV-12965.7Krkosova, Kubinec, et al., 2007100. m/0.32 mm/0.25 μm, Helium, 5. K/min, 310. C @ 5. min; Tstart: 30. C
CapillaryDB-12962.Katritzky, Chen, et al., 200030. m/0.32 mm/0.25 μm; Tstart: 60. C; Tend: 320. C

Normal alkane RI, non-polar column, custom temperature program

View large format table.

Column type Active phase I Reference Comment
CapillaryPolydimethyl siloxane2962.Junkes, Castanho, et al., 2003Program: not specified

References

Dykyj, Svoboda, et al., 1999
Dykyj, J.; Svoboda, J.; Wilhoit, R.C.; Frenkel, M.L.; Hall, K.R., Vapor Pressure of Chemicals: Part A. Vapor Pressure and Antoine Constants for Hydrocarbons and Sulfur, Selenium, Tellurium and Hydrogen Containing Organic Compounds, Springer, Berlin, 1999, 373. [all data]