Gallium monoiodide

Gas phase ion energetics data

Data compiled as indicated in comments:
LL - Sharon G. Lias and Joel F. Liebman
LLK - Sharon G. Lias, Rhoda D. Levin, and Sherif A. Kafafi

Ionization energy determinations

IE (eV) Method Reference Comment
9.03PEGrabandt, Mooyman, et al., 1990LL
9.0 ± 0.3EIKleinschmidt and Hildenbrand, 1978LLK
9.19PEGrabandt, Mooyman, et al., 1990Vertical value; LL

References

Grabandt, Mooyman, et al., 1990
Grabandt, O.; Mooyman, R.; De Lange, C.A., He(I) photoelectron spectroscopy of the gallium monohalides, Chem. Phys., 1990, 143, 227. [all data]

Kleinschmidt and Hildenbrand, 1978
Kleinschmidt, P.D.; Hildenbrand, D.L., Dissociation energies of CaI, SrI, and BaI from high temperature mass spectrometry, J. Chem. Phys., 1978, 68, 2819. [all data]