Molybdenum, pentacarbonyl(triethylphosphite-p-)-

Gas phase ion energetics data

Data compiled as indicated in comments:
LLK - Sharon G. Lias, Rhoda D. Levin, and Sherif A. Kafafi
RDSH - Henry M. Rosenstock, Keith Draxl, Bruce W. Steiner, and John T. Herron

Ionization energy determinations

IE (eV) Method Reference Comment
8.0PEYarbrough and Hall, 1978LLK
7.72EIPignataro, Foffani, et al., 1968RDSH

References

Yarbrough and Hall, 1978
Yarbrough, L.W., II; Hall, M.B., Photoelectron spectra of substituted chromium, molybdenum, and tungsten pentacarbonyls. Relative π-acceptor and σ-donor properties of various phosphorus ligands, Inorg. Chem., 1978, 17, 2269. [all data]

Pignataro, Foffani, et al., 1968
Pignataro, S.; Foffani, A.; Innorta, G.; Distefano, G., Mass spectra and ionization potentials of group VI-B substituted transition-metal carbonyls, Advan. Mass Spectrom., 1968, 4, 323. [all data]