1,2,4,5-Tetrazine, 3,6-dimethyl-

Gas phase ion energetics data

Data compiled by: Sharon G. Lias, Rhoda D. Levin, and Sherif A. Kafafi

Ionization energy determinations

IE (eV) Method Reference Comment
9.08PEGleiter, Heilbronner, et al., 1972Vertical value

References

Gleiter, Heilbronner, et al., 1972
Gleiter, R.; Heilbronner, E.; Hornung, V., Photoelectron spectra of azabenzenes azanaphthalenes: I. Pyridine, diazines s-triazine and s-tetrazine, Helv. Chim. Acta, 1972, 55, 255. [all data]

Hochstrasser, et al., 1977
Hochstrasser, R.M., et al., J. Am. Chem. Soc., 1977, 99, 3923. [all data]