9H-Fluorene, 4-methyl-

Lee's RI, non-polar column, temperature ramp

Data compiled by: NIST Mass Spectrometry Data Center, William E. Wallace, director

Column type CapillaryCapillary
Active phase DB-5DB-5
Column length (m) 30.30.
Carrier gas
Substrate
Column diameter (mm) 0.250.25
Phase thickness (μm) 0.250.25
Tstart (C) 50.50.
Tend (C) 300.300.
Heat rate (K/min) 15.15.
Initial hold (min)
Final hold (min)
I 256.3257.6
ReferenceDurlak, Biswas, et al., 1998Durlak, Biswas, et al., 1998
Comment MSDC-RI MSDC-RI

References

Durlak, Biswas, et al., 1998
Durlak, S.K.; Biswas, P.; Shi, J.; Bernhard, M.J., Characterization of polycyclic aromatic hydrocarbon particulate and gaseous emissions from polystyrene combustion, Environ. Sci. Technol., 1998, 32, 15, 2301-2307, https://doi.org/10.1021/es9709031 . [all data]