C11H5F9O7S3

Reaction thermochemistry data

Data compiled by: John E. Bartmess

Individual Reactions

C11H4F9O7S3- + Hydrogen cation = C11H5F9O7S3

By formula: C11H4F9O7S3- + H+ = C11H5F9O7S3

Quantity Value Units Method Reference Comment
Δr306.6 ± 2.0kcal/molIMREKoppel, Taft, et al., 1994gas phase

References

Koppel, Taft, et al., 1994
Koppel, I.A.; Taft, R.W.; Anvia, F.; Zhu, S.Z.; Hu, L.Q.; Sung, K.S.; Desmarteau, D.D.; Yagupolskii, L.M., The Gas-Phase Acidities of Very Strong Neutral Bronsted Acids, J. Am. Chem. Soc., 1994, 116, 7, 3047, https://doi.org/10.1021/ja00086a038 . [all data]