(S)-1,2-dilauryloxypropyl-3-arsonic acid

Phase change data

Data compiled by: William E. Acree, Jr., James S. Chickos

Enthalpy of fusion

ΔfusH (kJ/mol) Temperature (K) Method Reference
65.69363.3DSCServes, Sotiropoulos, et al., 1993

References

Serves, Sotiropoulos, et al., 1993
Serves, Spyros V.; Sotiropoulos, Demetrios N.; Ioannou, Panayiotis V.; Jain, Mahendra K., ONE POT SYNTHESIS OF ARSONOLIPIDS VIA THIOARSENITE PRECURSORS, Phosphorus, Sulfur, and Silicon and the Related Elements, 1993, 81, 1-4, 181-190, https://doi.org/10.1080/10426509308034388 . [all data]