2-Hexenoic acid, ethyl ester

Van Den Dool and Kratz RI, polar column, temperature ramp

Data compiled by: NIST Mass Spectrometry Data Center, William E. Wallace, director

Column type CapillaryCapillaryCapillary
Active phase InnowaxZB-WaxCarbowax 20M
Column length (m) 30.30.
Carrier gas HeHeHe
Substrate
Column diameter (mm) 0.250.25
Phase thickness (μm) 0.250.15
Tstart (C) 40.35.50.
Tend (C) 200.220.160.
Heat rate (K/min) 5.1.81.
Initial hold (min) 5.10.10.
Final hold (min) 2.10.
I 1343.1336.1305.
ReferencePena, Barciela, et al., 2005Ledauphin, Saint-Clair, et al., 2004Chen, Kuo, et al., 1982
Comment MSDC-RI MSDC-RI MSDC-RI

Normal alkane RI, non-polar column, custom temperature program

Data compiled by: NIST Mass Spectrometry Data Center, William E. Wallace, director

Column type CapillaryCapillaryCapillaryCapillaryCapillary
Active phase Polydimethyl siloxane with 5 % Ph groupsPolydimethyl siloxane with 5 % Ph groupsHP-5HP-5HP-5
Column length (m)   30.30.30.
Carrier gas
Substrate
Column diameter (mm)   0.250.250.25
Phase thickness (μm)   0.250.250.25
Program not specifiednot specified40 0C (2 min) 5 0C/min -> 80 0C 7 oC/min -> 160 0C 9 0C/min -> 200 0C 20 0C/min -> 280 0C (10 min)not specifiednot specified
I 1036.1049.1043.1030.1030.
ReferenceRobinson, Adams, et al., 2012Robinson, Adams, et al., 2012Zhao, Li, et al., 2008Zhao, Li, et al., 2008Jordán, Goodner, et al., 2002
Comment MSDC-RI MSDC-RI MSDC-RI MSDC-RI MSDC-RI

Normal alkane RI, polar column, custom temperature program

Data compiled by: NIST Mass Spectrometry Data Center, William E. Wallace, director

Column type CapillaryCapillaryCapillaryCapillary
Active phase DB-WaxDB-WaxDB-WaxSupelcowax-10
Column length (m) 30.30.30.30.
Carrier gas HeliumHeliumHeliumHe
Substrate
Column diameter (mm) 0.250.250.320.25
Phase thickness (μm) 0.250.250.250.25
Program not specifiednot specified40 0C (4 min) 3 0C/min -> 50 0C 5 0C/min -> 120 0C 7 0C/min -> 175 0C 10 0C/min -> 230 0C (8 min)40C(10min) => 2C/min => 200C(1min) => 2C/min => 250C (10min)
I 1357.1360.1360.1336.
ReferenceWelke, Manfroi, et al., 2012Welke, Manfroi, et al., 2012Yongsheng, Hua, et al., 2008Bosch-Fuste, Riu-Aumatell, et al., 2007
Comment MSDC-RI MSDC-RI MSDC-RI MSDC-RI

Van Den Dool and Kratz RI, non-polar column, custom temperature program

Data compiled by: NIST Mass Spectrometry Data Center, William E. Wallace, director

Column type CapillaryCapillary
Active phase VF-5MSDB-5
Column length (m) 30.30.
Carrier gas HeHe
Substrate
Column diameter (mm) 0.250.25
Phase thickness (μm) 0.250.25
Program 40C(2min) => 5C/min => 200C (2min) => 30C/min => 260C60C(2min) => 3C/min => 240C => 10C/min => 270C (4.5min)
I 1036.1038.
ReferenceCarasek and Pawliszyn, 2006Passos X.S., Castro A.C.M., et al., 2003
Comment MSDC-RI MSDC-RI

References

Pena, Barciela, et al., 2005
Pena, R.M.; Barciela, J.; Herrero, C.; Garcia-Martin, S., Optimization of solid-phase microextraction methods for GC-MS determination of terpenes in wine, J. Sci. Food Agric., 2005, 85, 7, 1227-1234, https://doi.org/10.1002/jsfa.2121 . [all data]

Ledauphin, Saint-Clair, et al., 2004
Ledauphin, J.; Saint-Clair, J.-F.; Lablanquie, O.; Guichard, H.; Founier, N.; Guichard, E.; Barillier, D., Identification of trace volatile compounds in freshly distilled calvados and cognac using preparative separations coupled with gas chromatography-mass spectrometry, J. Agric. Food Chem., 2004, 52, 16, 5124-5134, https://doi.org/10.1021/jf040052y . [all data]

Chen, Kuo, et al., 1982
Chen, C.-C.; Kuo, M.-C.; Hwang, L.S.; Wu, J.S.-B.; Wu, C.-M., Headspace components of passion fruit juice, J. Agric. Food Chem., 1982, 30, 6, 1211-1215, https://doi.org/10.1021/jf00114a052 . [all data]