Europium, tris(2,2,6,6-tetramethyl-3,5-heptanedionato)-

Phase change data

Data compiled by: William E. Acree, Jr., James S. Chickos

Enthalpy of vaporization

ΔvapH (kcal/mol) Temperature (K) Method Reference
20.9466. - 490.BGSicre, Dubois, et al., 1969

Enthalpy of sublimation

ΔsubH (kcal/mol) Temperature (K) Method Reference Comment
43.00398.MEAmano, Sato, et al., 1981Based on data from 363. - 433. K.
43.0373. - 423.MEAmano, Sato, et al., 1979
39.53448.BGSicre, Dubois, et al., 1969Based on data from 430. - 466. K.

Gas phase ion energetics data

Data compiled by: Henry M. Rosenstock, Keith Draxl, Bruce W. Steiner, and John T. Herron

Ionization energy determinations

IE (eV) Method Reference
9.8 ± 0.5EIMcDonald and Margrave, 1968

Appearance energy determinations

Ion AE (eV) Other Products MethodReferenceComment
C11H19O2Eu+24.0 ± 0.5?EIMcDonald and Margrave, 1968
C22H38O4Eu+16.5 ± 0.5?EIMcDonald and Margrave, 1968
C29H48O6Eu+12.7 ± 0.5?EIMcDonald and Margrave, 1968

References

Sicre, Dubois, et al., 1969
Sicre, Juan E.; Dubois, J.T.; Eisentraut, K.J.; Sievers, R.E., Volatile lanthanide chelates. II. Vapor pressures, heats of vaporization, and heats of sublimation, J. Am. Chem. Soc., 1969, 91, 13, 3476-3481, https://doi.org/10.1021/ja01041a011 . [all data]

Amano, Sato, et al., 1981
Amano, Ryohei; Sato, Akiko; Suzuki, Shin, Sublimation behavior of tris(2,2,6,6-tetramethyl-3,5-heptanedionato)lanthanoid(III)., Bull. Chem. Soc. Jpn., 1981, 54, 5, 1368-1374, https://doi.org/10.1246/bcsj.54.1368 . [all data]

Amano, Sato, et al., 1979
Amano, R.; Sato, A.; Suzuki, S., Vapor pressure measurements of europium(III) and americium(III) chelates of 2,2,6,6-tetramethyl-3,5-heptanedione by Knudsen method, Radiochem. Radioanal. Lett., 1979, 39, 6, 441. [all data]

McDonald and Margrave, 1968
McDonald, J.D.; Margrave, J.L., Mass-spectrometric studies of volatile Al, Sc, Co, Y, Zr and rare-earth chelates, J. Less-Common Metals, 1968, 14, 236. [all data]