Praseodymium, tris(2,2,6,6-tetramethyl-3,5-heptanedionato-O,O')-, (OC-6-11)-

Phase change data

Data compiled by: William E. Acree, Jr., James S. Chickos

Enthalpy of vaporization

ΔvapH (kcal/mol) Temperature (K) Method Reference
26.10495. - 530.BGSicre, Dubois, et al., 1969

Enthalpy of sublimation

ΔsubH (kcal/mol) Temperature (K) Method Reference Comment
42.71403.MEAmano, Sato, et al., 1981Based on data from 383. - 423. K.
39.53473.BGSicre, Dubois, et al., 1969Based on data from 450. - 495. K.

References

Sicre, Dubois, et al., 1969
Sicre, Juan E.; Dubois, J.T.; Eisentraut, K.J.; Sievers, R.E., Volatile lanthanide chelates. II. Vapor pressures, heats of vaporization, and heats of sublimation, J. Am. Chem. Soc., 1969, 91, 13, 3476-3481, https://doi.org/10.1021/ja01041a011 . [all data]

Amano, Sato, et al., 1981
Amano, Ryohei; Sato, Akiko; Suzuki, Shin, Sublimation behavior of tris(2,2,6,6-tetramethyl-3,5-heptanedionato)lanthanoid(III)., Bull. Chem. Soc. Jpn., 1981, 54, 5, 1368-1374, https://doi.org/10.1246/bcsj.54.1368 . [all data]