Spiro[3.4]octa-5,7-diene

Gas phase ion energetics data

Data compiled as indicated in comments:
LLK - Sharon G. Lias, Rhoda D. Levin, and Sherif A. Kafafi

Ionization energy determinations

IE (eV) Method Reference Comment
8.20PEBischof, Gleiter, et al., 1974LLK

References

Bischof, Gleiter, et al., 1974
Bischof, P.; Gleiter, R.; de Meijere, A.; Meyer, L.-U., The conjugative interaction between π-orbitals and cyclobutane-orbitals in spiro[3.4]octa-5,7-diene and spiro[3.4]octene-5, Helv. Chim. Acta, 1974, 57, 1519. [all data]