1,5-Cyclodecadiene, 1,5-dimethyl-8-(1-methylethylidene)-, (E,E)-

Van Den Dool and Kratz RI, polar column, temperature ramp

Data compiled by: NIST Mass Spectrometry Data Center, William E. Wallace, director

Column type CapillaryCapillaryCapillaryCapillaryCapillary
Active phase RTX-WaxDB-WaxDB-WaxRTX-WaxHP-Wax
Column length (m) 60.30.30.60.30.
Carrier gas HeHeHeHeN2
Substrate
Column diameter (mm) 0.220.250.250.220.25
Phase thickness (μm) 0.250.250.250.250.25
Tstart (C) 60.40.40.60.60.
Tend (C) 230.250.250.230.220.
Heat rate (K/min) 2.3.3.2.5.
Initial hold (min)     10.
Final hold (min) 35.20.20.35.
I 1816.1806.1805.1816.1789.
ReferencePaolini J., Costa J., et al., 2007Fanciullino, Gancel, et al., 2005Gancel, Ollitrault, et al., 2005Paolini, Costa, et al., 2005Bertoli, Pistelli, et al., 2004
Comment MSDC-RI MSDC-RI MSDC-RI MSDC-RI MSDC-RI
Column type CapillaryCapillaryCapillaryCapillaryCapillary
Active phase Supelcowax-10DB-WaxSupelcowaxSupelcowaxDB-Wax
Column length (m) 30.30.25.25.60.
Carrier gas HeHe  H2
Substrate
Column diameter (mm) 0.20.250.250.250.32
Phase thickness (μm) 0.20.250.250.250.25
Tstart (C) 70.40.35.35.40.
Tend (C) 220.200.225.225.245.
Heat rate (K/min) 3.4.4.4.1.5
Initial hold (min)  5.5.5.
Final hold (min) 15.20.10.10.20.
I 1819.1802.1864.1864.1805.
ReferenceCavaleiro, Salgueiro, et al., 2004Yu, Kim, et al., 2004Chisholm, Wilson, et al., 2003Chisholm, Wilson, et al., 2003Gancel, Ollitrault, et al., 2003
Comment MSDC-RI MSDC-RI MSDC-RI MSDC-RI MSDC-RI
Column type CapillaryCapillaryCapillaryCapillaryCapillary
Active phase MegawaxMegawaxDB-WaxCarbowax 20MDB-Wax
Column length (m) 30.30.60.50.30.
Carrier gas HeHe HeHe
Substrate
Column diameter (mm) 0.250.250.250.20.32
Phase thickness (μm) 0.250.250.250.20.5
Tstart (C) 40.40.40.30.40.
Tend (C) 220.220.200.170.220.
Heat rate (K/min) 2.2.3.4.3.
Initial hold (min) 6.6.5.2.
Final hold (min) 10.10.60.20.
I 1778.1778.1836.1828.1823.
ReferenceVerzera, Trozzi, et al., 2003Verzera, Trozzi, et al., 2000Cha, Kim, et al., 1998Píry, Príbela, et al., 1995Le Quere and Latrasse, 1990
Comment MSDC-RI MSDC-RI MSDC-RI MSDC-RI MSDC-RI
Column type Capillary
Active phase Carbowax 20M
Column length (m) 60.
Carrier gas He
Substrate
Column diameter (mm) 0.32
Phase thickness (μm)
Tstart (C) 50.
Tend (C) 225.
Heat rate (K/min) 1.5
Initial hold (min)
Final hold (min) 80.
I 1795.
ReferenceChen and Ho, 1988
Comment MSDC-RI

Normal alkane RI, polar column, temperature ramp

Data compiled by: NIST Mass Spectrometry Data Center, William E. Wallace, director

Column type CapillaryCapillaryCapillaryCapillaryCapillary
Active phase RTX-WaxHP-InnowaxSupelcowax-10Supelcowax-10Supelcowax 10
Column length (m) 60.60.30.30.30.
Carrier gas HeliumHelium HeHelium
Substrate
Column diameter (mm) 0.220.250.250.250.20
Phase thickness (μm) 0.250.250.250.250.20
Tstart (C) 60.60.40.40.70.
Tend (C) 230.220.250.250.220.
Heat rate (K/min) 2.5.2.3.3.
Initial hold (min)  1. 5.
Final hold (min) 5.5.33.10.15.
I 1794.1834.1819.1800.1818.
ReferenceBendiabdellah, El Amine Dib, et al., 2012Feng, Cui, et al., 2011Sylvestre, Pichette, et al., 2007Vichi, Riu-Aumatell, et al., 2007Cavaleiro, Pinto, et al., 2006
Comment MSDC-RI MSDC-RI MSDC-RI MSDC-RI MSDC-RI
Column type CapillaryCapillaryCapillaryCapillaryCapillary
Active phase Supelcowax-10NB-20MSupelcowax-10Supelcowax-10Supelcowax-10
Column length (m) 30.30.30.30.30.
Carrier gas  HeHe N2
Substrate
Column diameter (mm) 0.250.20.250.250.25
Phase thickness (μm) 0.250.250.250.250.25
Tstart (C) 40.50.50.40.40.
Tend (C) 210.250.220.220.230.
Heat rate (K/min) 2.2.4.3.2.
Initial hold (min) 2. 1.5.
Final hold (min) 33. 10.10.
I 1818.1830.1820.1800.1811.
ReferenceGarneau F.X., Collin G., et al., 2006Orav, Raal, et al., 2006Wong, Lim, et al., 2006Vichi, Riu-Aumatell, et al., 2005González, Guerra, et al., 2004
Comment MSDC-RI MSDC-RI MSDC-RI MSDC-RI MSDC-RI
Column type CapillaryCapillaryCapillaryCapillaryCapillary
Active phase DB-WaxSW-10CP-Wax 52CBSupelcowax-10HP-Innowax
Column length (m) 60.50.60.50.50.
Carrier gas HeHeHeHe
Substrate
Column diameter (mm) 0.320.200.250.20.2
Phase thickness (μm) 0.250.250.250.250.2
Tstart (C) 35.50.40.70.50.
Tend (C) 220.230.220.230.220.
Heat rate (K/min) 3.2.3.2.4.
Initial hold (min)     5.
Final hold (min)
I 1832.1800.1827.1813.1776.
ReferencePalá-Paúl, Brophy, et al., 2004Raal, Paaver, et al., 2004Mau, Lai, et al., 2003Orav, Kailas, et al., 2003Stashenko, Jaramillo, et al., 2003
Comment MSDC-RI MSDC-RI MSDC-RI MSDC-RI MSDC-RI
Column type CapillaryCapillaryCapillaryCapillaryCapillary
Active phase DB-WaxDB-WaxDB-WaxSupelcowax-10Supelcowax-10
Column length (m) 60.60.60.30.60.
Carrier gas N2N2H2 He
Substrate
Column diameter (mm) 0.250.250.320.250.2
Phase thickness (μm) 0.250.250.250.250.5
Tstart (C) 70.70.40.40.70.
Tend (C) 230.230.245.210.220.
Heat rate (K/min) 2.2.1.52.2.
Initial hold (min) 2.2. 2.
Final hold (min) 20.20.20.33.
I 1817.1817.1807.1791.1805.
ReferenceTu, Onishi, et al., 2003Tu, Onishi, et al., 2003, 2Gancel, Ollé, et al., 2002Kabouss, Charrouf, et al., 2002Orav, Kailas, et al., 2002
Comment MSDC-RI MSDC-RI MSDC-RI MSDC-RI MSDC-RI
Column type CapillaryCapillaryCapillaryCapillaryCapillary
Active phase TC-WaxInnowaxDB-WaxDB-WaxSupelcowax-10
Column length (m) 60.60.30.30.0.
Carrier gas HeHeN2N2He
Substrate
Column diameter (mm) 0.250.250.250.250.25
Phase thickness (μm)  0.250.250.25
Tstart (C) 80.60.45.45.40.
Tend (C) 250.220.220.220.240.
Heat rate (K/min) 4.4.3.3.3.
Initial hold (min)  10.
Final hold (min) 47.10.
I 1824.1854.1861.1844.1811.
ReferenceMiyazawa, Kurose, et al., 2001Baser, Özek, et al., 2000Molleken U., Sinnwell V., et al., 1998Mölleken, Sinnwell, et al., 1998Zygadlo, Ariza-Espinar, et al., 1997
Comment MSDC-RI MSDC-RI MSDC-RI MSDC-RI MSDC-RI
Column type Capillary
Active phase Carbowax 20M
Column length (m) 45.
Carrier gas Hydrogen
Substrate
Column diameter (mm) 0.32
Phase thickness (μm) 1.0
Tstart (C) 60.
Tend (C) 200.
Heat rate (K/min) 2.
Initial hold (min) 5.
Final hold (min)
I 1799.
ReferenceKollmannsberger, Nitz, et al., 1992
Comment MSDC-RI

Kovats' RI, polar column, temperature ramp

Data compiled by: NIST Mass Spectrometry Data Center, William E. Wallace, director

Column type CapillaryCapillaryCapillaryCapillary
Active phase Supelcowax-10DB-WaxInnowaxCarbowax 20M
Column length (m) 30.30.30.50.
Carrier gas  HeHeHe
Substrate
Column diameter (mm) 0.250.320.250.3
Phase thickness (μm) 0.250.250.25
Tstart (C) 40.40.50.70.
Tend (C) 210.220.250.210.
Heat rate (K/min) 2.3.0.52.
Initial hold (min) 2.5.5.
Final hold (min) 33. 10.
I 1819.1802.1795.1802.
ReferenceSylvestre, Pichette, et al., 2006Lopes, Strobl, et al., 2004Viña and Murillo, 2003Randriamiharisoa and Gaydou, 1987
Comment MSDC-RI MSDC-RI MSDC-RI MSDC-RI

Van Den Dool and Kratz RI, polar column, custom temperature program

Data compiled by: NIST Mass Spectrometry Data Center, William E. Wallace, director

Column type Capillary
Active phase FFAP
Column length (m) 30.
Carrier gas He
Substrate
Column diameter (mm) 0.32
Phase thickness (μm) 0.25
Program 40C(1min) => 40C/min => 60C => 6C/min => 230C
I 1821.
ReferenceJagella and Grosch, 1999
Comment MSDC-RI

References

Paolini J., Costa J., et al., 2007
Paolini J.; Costa J.; Bernardini A.F., Analysis of the essential oil from the roots of Eupatorium cannabinum subsp corsicum (L.) by GC, GC-MS and C-13-NMR, Phytochem. Anal., 2007, 18, 3, 235-244, https://doi.org/10.1002/pca.977 . [all data]

Fanciullino, Gancel, et al., 2005
Fanciullino, A.-L.; Gancel, A.-L.; Froelicher, Y.; Luro, F.; Ollitrault, P.; Brillouet, J.-M., Effects of Nucleo-cytoplasmic Interactions on Leaf Volatile Compounds from Citrus Somatic Diploid Hybrids, J. Agric. Food Chem., 2005, 53, 11, 4517-4523, https://doi.org/10.1021/jf0502855 . [all data]

Gancel, Ollitrault, et al., 2005
Gancel, A.-L.; Ollitrault, P.; Froelicher, Y.; Tomi, F.; Jacquemond, C.; Luro, F.; Brillouet, J.-M., Leaf volatile compounds of six citrus somatic allotetraploid hybrids originating from various combinations of lime, lemon, citron, sweet orange, and grapefruit, J. Agric. Food Chem., 2005, 53, 6, 2224-2230, https://doi.org/10.1021/jf048315b . [all data]

Paolini, Costa, et al., 2005
Paolini, J.; Costa, J.; Bernardini, A., Analysis of the essential oil from aerial parts of Eupatorium cannabinum subsp. corsicum (L.) by gas chromatography with electron impact and chemical ionization mass spectrometry, J. Chromatogr. A, 2005, 1076, 1-2, 170-178, https://doi.org/10.1016/j.chroma.2005.03.131 . [all data]

Bertoli, Pistelli, et al., 2004
Bertoli, A.; Pistelli, L.; Morelli, I.; Fraternale, D.; Giamperi, L.; Ricci, D., Volatile constituents of different parts (roots, stems and leaves) of Smyrnium olusatrum L., Flavour Fragr. J., 2004, 19, 6, 522-525, https://doi.org/10.1002/ffj.1382 . [all data]

Cavaleiro, Salgueiro, et al., 2004
Cavaleiro, C.; Salgueiro, L.R.; Miguel, M.G.; da Cunha, A.P., Analysis by gas chromatography?mass spectrometry of the volatile components of Teucrium lusitanicum and Teucrium algarbiensis, J. Chromatogr. A, 2004, 1033, 1, 187-190, https://doi.org/10.1016/j.chroma.2004.01.005 . [all data]

Yu, Kim, et al., 2004
Yu, E.J.; Kim, T.H.; Kim, K.H.; Lee, H.J., Characterization of aroma-active compounds of Abies nephrolepis (Khingan fir) needles using aroma extract dilution analysis, Flavour Fragr. J., 2004, 19, 1, 74-79, https://doi.org/10.1002/ffj.1314 . [all data]

Chisholm, Wilson, et al., 2003
Chisholm, M.G.; Wilson, M.A.; Gaskey, G.M., Characterization of aroma volatiles in key lime essential oils (Cirtrus aurantifolia Swingle), Flavour Fragr. J., 2003, 18, 2, 106-115, https://doi.org/10.1002/ffj.1172 . [all data]

Gancel, Ollitrault, et al., 2003
Gancel, A.-L.; Ollitrault, P.; Froelicher, Y.; Tomi, F.; Jacquemond, C.; Luro, F.; Brillouet, J.-M., Leaf volatile compounds of seven citrus somatic tetraploid hybrids sharing willow leaf mandarin (Citrus deliciosa Ten.) as their common parent, J. Agric. Food Chem., 2003, 51, 20, 6006-6013, https://doi.org/10.1021/jf0345090 . [all data]

Verzera, Trozzi, et al., 2003
Verzera, A.; Trozzi, A.; Gazea, F.; Cicciarelloi, G.; Cotroneo, A., Effects of rootstock on the composition of bergamot (Citrus bergamia Risso et Poiteau) essential oil, J. Agric. Food Chem., 2003, 51, 1, 206-210, https://doi.org/10.1021/jf0206872 . [all data]

Verzera, Trozzi, et al., 2000
Verzera, A.; Trozzi, A.; Cotroneo, A.; Lorenzo, D.; Dellacassa, E., Uruguayan essential oil. 12. Composition of Nova and Satsuma mandarin oils, J. Agric. Food Chem., 2000, 48, 7, 2903-2909, https://doi.org/10.1021/jf990734z . [all data]

Cha, Kim, et al., 1998
Cha, Y.J.; Kim, H.; Cadwallader, K.R., Aroma-active compounds in Kimchi during fermentation, J. Agric. Food Chem., 1998, 46, 5, 1944-1953, https://doi.org/10.1021/jf9706991 . [all data]

Píry, Príbela, et al., 1995
Píry, J.; Príbela, A.; Durcanská, J.; Farkas, P., Fractionation of volatiles from blackcurrant (Ribes nigrum L.) by different extractive methods, Food Chem., 1995, 54, 1, 73-77, https://doi.org/10.1016/0308-8146(95)92665-7 . [all data]

Le Quere and Latrasse, 1990
Le Quere, J.-L.; Latrasse, A., Composition of the Essential Oils of Blackcurrant Buds (Ribes nigrum L.), J. Agric. Food Chem., 1990, 38, 1, 3-10, https://doi.org/10.1021/jf00091a001 . [all data]

Chen and Ho, 1988
Chen, C.-C.; Ho, C.-T., Gas chromatographic analysis of volatile components of ginger oil (Zingiber officinale Roscoe) extracted with liquid carbon dioxide, J. Agric. Food Chem., 1988, 36, 2, 322-328, https://doi.org/10.1021/jf00080a020 . [all data]