Ethanol, 2,2'-(dodecylimino)bis-

Reaction thermochemistry data

Data compiled by: Hussein Y. Afeefy, Joel F. Liebman, and Stephen E. Stein

Individual Reactions

Ethanol, 2,2'-(dodecylimino)bis- = 1-Dodecanamine + 2Ethylene oxide

By formula: C16H35NO2 = C12H27N + 2C2H4O

Quantity Value Units Method Reference Comment
Δr-240.0 ± 6.5kcal/molEqkBalcerowiak, Jerzykiewicz, et al., 1984solid phase

References

Balcerowiak, Jerzykiewicz, et al., 1984
Balcerowiak, W.; Jerzykiewicz, W.; Szewczyk, H., Differential thermal analysis using closed pans. The ethoxylation of n-dodecylamine, Tenside Deterg., 1984, 21, 10-11. [all data]