ClCCCCl
- Formula: C3Cl2
- Molecular weight: 106.938
- CAS Registry Number: 153698-76-1

Vibrational and/or electronic energy levels

Data compiled by: Marilyn E. Jacox
State: ?
Energy (cm-1) |
Med. | Transition | λmin (nm) |
λmax (nm) |
References | ||
---|---|---|---|---|---|---|---|
Ar | 275 | 320 | Maier, Preiss, et al., 1994 | ||||
State: X
Vib. sym. |
No. | Approximate type of mode |
cm-1 | Med. | Method | References | |
---|---|---|---|---|---|---|---|
a' | 1 | C=C stretch | 2079.9 | vs | Ar | IR | Maier, Preiss, et al., 1994 |
2 | C-C stretch | 1192.8 | w m | Ar | IR | Maier, Preiss, et al., 1994 | |
3 | CCl stretch | 743.0 | s | Ar | IR | Maier, Preiss, et al., 1994 | |
Additional references: Jacox, 1998, page 299

References

Maier, Preiss, et al., 1994
Maier, G.; Preiss, T.; Reisenauer, H.P.; Hess, B.A., Jr.; Schaad, L.J.,
Small Rings. Part 81. Chlorinated Cyclopropenylidenes, Vinylidenecarbenes, and Propargylenes: Identification by Matrix Isolation Spectroscopy,
J. Am. Chem. Soc., 1994, 116, 5, 2014, https://doi.org/10.1021/ja00084a047
. [all data]
Jacox, 1998
Jacox, M.E.,
Vibrational and electronic energy levels of polyatomic transient molecules: supplement A,
J. Phys. Chem. Ref. Data, 1998, 27, 2, 115-393, https://doi.org/10.1063/1.556017
. [all data]