Aluminum tribromide- pyridine complex

Phase change data

Data compiled by: William E. Acree, Jr., James S. Chickos

Enthalpy of sublimation

ΔsubH (kJ/mol) Temperature (K) Method Reference
71.2 ± 0.6501. - 633.TGrigor'ev, Kondrat'ev, et al., 1989

References

Grigor'ev, Kondrat'ev, et al., 1989
Grigor'ev, A.A.; Kondrat'ev, Yu.V.; Suvorov, A.V.; Nikolaeva, V.I., Comparison of acceptor properties of Group IIIA element bromides relative to pyridine in the gas phase, Zh. Obshch. Khim., 1989, 59, 8, 1834. [all data]