3-Tridecanone

Normal alkane RI, non-polar column, temperature ramp

Data compiled by: NIST Mass Spectrometry Data Center, William E. Wallace, director

Column type CapillaryCapillaryCapillary
Active phase HP-5 MSHP-5 MSCross-Linked Methylsilicone
Column length (m) 30.30.25.
Carrier gas  HeliumHe
Substrate
Column diameter (mm) 0.250.250.32
Phase thickness (μm) 0.250.25
Tstart (C) 60.60.35.
Tend (C) 300.300.225.
Heat rate (K/min) 15.15.4.
Initial hold (min) 2.2.3.
Final hold (min) 10.10.
I 1498.1498.1472.
ReferenceXu, Han, et al., 2012Xu, Han, et al., 2009Bravo and Hotchkiss, 1993
Comment MSDC-RI MSDC-RI MSDC-RI

Phase change data

Data compiled as indicated in comments:
BS - Robert L. Brown and Stephen E. Stein
TRC - Thermodynamics Research Center, NIST Boulder Laboratories, Chris Muzny director

Quantity Value Units Method Reference Comment
Tc716.1KN/APulliam, Gude, et al., 1995Uncertainty assigned by TRC = 1.7 K; TRC
Quantity Value Units Method Reference Comment
ρc1.22mol/lN/APulliam, Gude, et al., 1995Uncertainty assigned by TRC = 0.04 mol/l; TRC

Reduced pressure boiling point

Tboil (K) Pressure (atm) Reference Comment
413.20.022Weast and Grasselli, 1989BS

In addition to the Thermodynamics Research Center (TRC) data available from this site, much more physical and chemical property data is available from the following TRC products:

References

Xu, Han, et al., 2012
Xu, L.-L.; Han, T.; Wu, J.-Z.; Zhang, Q.-Y.; Zhang, H.; Huang, B.-K.; Rahman, K., Comparative research of chemical constituents, antifungal and antitumor properties of ether extracts of Panax ginseng and its endophytic fungus, 2012, retrieved from http://www.thefreelibrary.com/Comparative .... [all data]

Xu, Han, et al., 2009
Xu, L.-L.; Han, T.; Wu, J.-Z.; Zhang, Q.-Y.; Zhang, H.; Huang, B.-K.; Rahman, K., Comparative research of chemical constituents, antifungal and antitumor properties of ether extracts of Panax ginseng and its endophytic fungus, Phytomedicine: Int. J. Phytotherapy Phytopharmacology, 2009, 16, 6-7, 609-616, https://doi.org/10.1016/j.phymed.2009.03.014 . [all data]

Bravo and Hotchkiss, 1993
Bravo, A.; Hotchkiss, J.H., Identification of volatile compounds resulting from the thermal oxidation of polyethylene, J. Appl. Polym. Sci., 1993, 47, 10, 1741-1748, https://doi.org/10.1002/app.1993.070471004 . [all data]