W18 radical

Gas phase ion energetics data

Data compiled by: John E. Bartmess

Electron affinity determinations

EA (eV) Method Reference Comment
2.440 ± 0.050LPESWeidele, Kreisle, et al., 1995Stated electron affinity is the Vertical Detachment Energy

References

Weidele, Kreisle, et al., 1995
Weidele, H.; Kreisle, D.; Recknagel, E.; Icking-Konert, G.S.; Handschuh, H.; Gantefor, G.; Eberhardt, W., Thermionic Emission from Small Clusters: Direct Observation of the Kinetic Energy Distribution of the Electrons., Chem. Phys. Lett., 1995, 237, 5-6, 425., https://doi.org/10.1016/0009-2614(95)00344-4 . [all data]