Methyl thiolacetate

Van Den Dool and Kratz RI, polar column, custom temperature program

Data compiled by: NIST Mass Spectrometry Data Center, William E. Wallace, director

Column type CapillaryCapillary
Active phase Supelcowax-10DB-FFAP
Column length (m) 30.30.
Carrier gas He
Substrate
Column diameter (mm) 0.250.32
Phase thickness (μm) 0.250.25
Program 35C(8min) => 4C/min => 60C => 6C/min => 160C => 20C/min => 200C(1min)35C(2min) => 6C/min => 180C => 10C/min => 240C (10min)
I 1056.1046.
ReferenceBianchi, Careri, et al., 2007Huynh-Ba, Matthey-Doret, et al., 2003
Comment MSDC-RI MSDC-RI

Phase change data

Data compiled by: Thermodynamics Research Center, NIST Boulder Laboratories, Chris Muzny director

Quantity Value Units Method Reference Comment
Tboil371.3KN/ADunbar and Bolstad, 1955Uncertainty assigned by TRC = 2. K

In addition to the Thermodynamics Research Center (TRC) data available from this site, much more physical and chemical property data is available from the following TRC products:

Van Den Dool and Kratz RI, polar column, temperature ramp

Data compiled by: NIST Mass Spectrometry Data Center, William E. Wallace, director

Column type CapillaryCapillaryCapillaryCapillaryCapillary
Active phase CP-Wax 52CBDB-WaxFFAPDB-WaxDB-Wax
Column length (m) 60.60.30.60.60.
Carrier gas He HeHeHe
Substrate
Column diameter (mm) 0.250.250.250.250.25
Phase thickness (μm) 0.250.250.250.25
Tstart (C) 40.40.20.50.35.
Tend (C) 250.200.200.230.180.
Heat rate (K/min) 4.3.4.3.3.
Initial hold (min)  5.1. 5.
Final hold (min)  60.1.
I 1052.1041.1057.1090.1047.
ReferenceKourkoutas, Elmore, et al., 2006Cha, Kim, et al., 1998Ott, Fay, et al., 1997Shimoda, Peralta, et al., 1996Stashenko, Macku, et al., 1992
Comment MSDC-RI MSDC-RI MSDC-RI MSDC-RI MSDC-RI

Van Den Dool and Kratz RI, non-polar column, custom temperature program

Data compiled by: NIST Mass Spectrometry Data Center, William E. Wallace, director

Column type CapillaryCapillary
Active phase DB-5BPX-5
Column length (m) 30.50.
Carrier gas HeHe
Substrate
Column diameter (mm) 0.250.32
Phase thickness (μm) 0.250.50
Program 50C (1min) => 5C/min => 100C => 10C/min => 250C (9min)0 0C (8 min) -> (1 min) -> 50 0C (2 min) 2.5 0C/min -> 100 0C 6 0C/min -> 250 0C
I 701.702.
ReferenceBeaulieu and Grimm, 2001Bauchot, Mottram, et al., 1998
Comment MSDC-RI MSDC-RI

References

Bianchi, Careri, et al., 2007
Bianchi, F.; Careri, M.; Mangia, A.; Musci, M., Retention indices in the analysis of food aroma volatile compounds in temperature-programmed gas chromatography: Database creation and evaluation of precision and robustness, J. Sep. Sci., 2007, 39, 4, 563-572, https://doi.org/10.1002/jssc.200600393 . [all data]

Huynh-Ba, Matthey-Doret, et al., 2003
Huynh-Ba, T.; Matthey-Doret, W.; Fay, L.B.; Rhlid, R.B., Generation of thiols by biotransformation of cysteine-aldehyde conjugates with Baker's yeast, J. Agric. Food Chem., 2003, 51, 12, 3629-3635, https://doi.org/10.1021/jf026198j . [all data]