Aluminum, tris(1,1,1,5,5,5-hexafluoro-2,4-pentanedionato-o,o')-

Gas phase ion energetics data

Data compiled as indicated in comments:
LLK - Sharon G. Lias, Rhoda D. Levin, and Sherif A. Kafafi
RDSH - Henry M. Rosenstock, Keith Draxl, Bruce W. Steiner, and John T. Herron

Ionization energy determinations

IE (eV) Method Reference Comment
9.6 ± 0.2EIWestmore, Reimer, et al., 1981LLK
9.65 ± 0.05PEWestmore, Reimer, et al., 1981LLK
9.8 ± 0.1EIReichert, Bancroft, et al., 1970RDSH
10.30 ± 0.11EISchildcrout, Pearson, et al., 1968RDSH
10.33 ± 0.07PEEvans, Hamnett, et al., 1972Vertical value; LLK
10.21PELloyd, 1970Vertical value; RDSH

Appearance energy determinations

Ion AE (eV) Other Products MethodReferenceComment
C10H2O4F12Al+11.2 ± 0.1?EIReichert, Bancroft, et al., 1970RDSH
C14H3O6F15Al+10.7 ± 0.1CF3EIReichert, Bancroft, et al., 1970RDSH

References

Westmore, Reimer, et al., 1981
Westmore, J.B.; Reimer, M.L.J.; Reichert, C., Ionization energies of metal chelates. Acetylacetonates, trifluoroacetylacetonates, and hexafluoroacetylacetonates of trivalent metals of the first transition series, Can. J. Chem., 1981, 59, 1797. [all data]

Reichert, Bancroft, et al., 1970
Reichert, C.; Bancroft, G.M.; Westmore, J.B., Mass spectral studies of metal chelates. V. Mass spectra and appearance potentials of some fluorine-substituted acetylacetonates, Can. J. Chem., 1970, 48, 1362. [all data]

Schildcrout, Pearson, et al., 1968
Schildcrout, S.M.; Pearson, R.G.; Stafford, F.E., Ionization potentials of tris(-diketonate)metal(III) complexes and Koopmans' theorem, J. Am. Chem. Soc., 1968, 90, 4006. [all data]

Evans, Hamnett, et al., 1972
Evans, S.; Hamnett, A.; Orchard, A.F.; Lloyd, D.R., Study of the metal-oxygen bond in simple tris-chelate complexes by He(I) photoelectron spectroscopy, Faraday Discuss. Chem. Soc., 1972, 54, 227. [all data]

Lloyd, 1970
Lloyd, D.R., Photoelectron spectra of transition-metal hexafluoroacetylacetonates and the supposed breakdown of Koopmans' theorem in these compounds, Chem. Commun., 1970, 868. [all data]