4-(cis-4-hexenyloxy)-3',4'-difluorodiphenyldiacetylene

Phase change data

Data compiled by: William E. Acree, Jr., James S. Chickos

Enthalpy of fusion

ΔfusH (kJ/mol) Temperature (K) Method Reference
35.32364.4DSCJuang, Chen, et al., 1993

References

Juang, Chen, et al., 1993
Juang, T.M.; Chen, Y.N.; Lung, S.H.; Lu, Y.H.; Hsu, C.S.; Wu, S.T., Synthesis and characterization of novel fluorinated diphenyldiacetylenic liquid crystals, Liquid Crystals, 1993, 15, 4, 529-540, https://doi.org/10.1080/02678299308036472 . [all data]