(CH3)2SiOHCHO

Vibrational and/or electronic energy levels

Data compiled by: Marilyn E. Jacox

State:   X

Vib.
sym.
 No.   Approximate
 type of mode
 cm-1   Med.   Method   References

OH stretch 3660.2 m s Ar IR Trommer, Sander, et al., 1993
3651.2 m Ar IR Trommer, Sander, et al., 1993
3645.9 m Ar IR Trommer, Sander, et al., 1993
2764.2 w m Ar IR Trommer, Sander, et al., 1993
2658.9 w m Ar IR Trommer, Sander, et al., 1993
2653.7 m Ar IR Trommer, Sander, et al., 1993
C=O stretch 1655.0 m Ar IR Trommer, Sander, et al., 1993
1258.8 vs Ar IR Trommer, Sander, et al., 1993
1051.3 s Ar IR Trommer, Sander, et al., 1993
952.2 vs Ar IR Trommer, Sander, et al., 1993
941.6 vs Ar IR Trommer, Sander, et al., 1993
868.8 s Ar IR Trommer, Sander, et al., 1993
805.7 s Ar IR Trommer, Sander, et al., 1993
547.8 w m Ar IR Trommer, Sander, et al., 1993

Additional references: Jacox, 1998, page 365

References

Trommer, Sander, et al., 1993
Trommer, M.; Sander, W.; Patyk, A., Oxidation of methylsilenes with molecular oxygen. A matrix isolation study, J. Am. Chem. Soc., 1993, 115, 25, 11775, https://doi.org/10.1021/ja00078a016 . [all data]

Jacox, 1998
Jacox, M.E., Vibrational and electronic energy levels of polyatomic transient molecules: supplement A, J. Phys. Chem. Ref. Data, 1998, 27, 2, 115-393, https://doi.org/10.1063/1.556017 . [all data]