tris(pyridine)tricarbonylmolybdenum

Phase change data

Data compiled by: William E. Acree, Jr., James S. Chickos

Quantity Value Units Method Reference Comment
Δsub142. ± 10.kJ/molN/APilcher and Skinner, 1983See also Adedeji, Connor, et al., 1978.

References

Pilcher and Skinner, 1983
Pilcher, G.; Skinner, H.A., Thermochemistry of organometallic compounds, 1983, 43-90, https://doi.org/10.1002/9780470771686.ch2 . [all data]

Adedeji, Connor, et al., 1978
Adedeji, Festus A.; Connor, Joseph A.; Demain, Christopher P.; Martinho-Simoes, Jose A.; Skinner, Henry A.; Zafarani Moattar, Mohamed T., The thermochemistry of carbonyl complexes of Cr, Mo and W with pyridine and acetonitrile, Journal of Organometallic Chemistry, 1978, 149, 3, 333-343, https://doi.org/10.1016/S0022-328X(00)90399-1 . [all data]