Thorium dichloride

Gas phase ion energetics data

Data compiled by: Sharon G. Lias and Joel F. Liebman

Ionization energy determinations

IE (eV) Method Reference
6.2 ± 0.3EILau and Hildenbrand, 1990

Appearance energy determinations

Ion AE (eV) Other Products MethodReferenceComment
ClTh+13. ± 1.ClEILau and Hildenbrand, 1990

References

Lau and Hildenbrand, 1990
Lau, K.H.; Hildenbrand, D.L., High-temperature equilibrium studies of the gaseous thorium chlorides, J. Chem. Phys., 1990, 92, 6124. [all data]