Palladium, bis(2,2,6,6-tetramethyl-3,5-heptanedionato-o,o')-

Gas phase ion energetics data

Data compiled by: Sharon G. Lias, Rhoda D. Levin, and Sherif A. Kafafi

Ionization energy determinations

IE (eV) Method Reference Comment
7.67PEFragala, Costanzo, et al., 1980Vertical value

References

Fragala, Costanzo, et al., 1980
Fragala, I.; Costanzo, L.L.; Ciliberto, E.; Condorelli, G.; D'Arrigo, C., He-I and He-II excited photoelectron spectra of tetracoordinated complexes of transition metal ions with β-diketonate ligands, Inorg. Chim. Acta, 1980, 40, 15. [all data]