TeF4 radical

Reaction thermochemistry data

Data compiled by: John E. Bartmess

Individual Reactions

(CAS Reg. No. 32369-53-2 • 4294967295F4Te) + F4Te = CAS Reg. No. 32369-53-2

By formula: (CAS Reg. No. 32369-53-2 • 4294967295F4Te) + F4Te = CAS Reg. No. 32369-53-2

Quantity Value Units Method Reference Comment
Δr359.4kJ/molN/ACheck, Faust, et al., 2001gas phase; Sc-(s); ; ΔS(EA)=6.4
Quantity Value Units Method Reference Comment
Δr325.1kJ/molN/ACheck, Faust, et al., 2001gas phase; Sc-(s); ; ΔS(EA)=6.4

Gas phase ion energetics data

Data compiled by: John E. Bartmess

Electron affinity determinations

EA (eV) Method Reference Comment
2.20 ± 0.10EIAEHarland and Thynne, 1973From TeF6
2.3996N/ACheck, Faust, et al., 2001PhH..Sc-; ; ΔS(EA)=3.7

References

Check, Faust, et al., 2001
Check, C.E.; Faust, T.O.; Bailey, J.M.; Wright, B.J.; Gilbert, T.M.; Sunderlin, L.S., Addition of Polarization and Diffuse Functions to the LANL2DZ Basis Set for P-Block Elements, J. Phys. Chem. A,, 2001, 105, 34, 8111, https://doi.org/10.1021/jp011945l . [all data]

Harland and Thynne, 1973
Harland, P.W.; Thynne, J.C.J., Comparision of negative ion formation by the hexafluorides of sulphur, selenium, tellurium, and tungsten, Inorg. Nucl. Chem. Lett., 1973, 9, 265. [all data]