1-heptyl-4-methylbenzene

Phase change data

Data compiled by: Thermodynamics Research Center, NIST Boulder Laboratories, Chris Muzny director

Quantity Value Units Method Reference Comment
Tfus244.7KN/ASchmidt and Schoeller, 1941Uncertainty assigned by TRC = 1. K

In addition to the Thermodynamics Research Center (TRC) data available from this site, much more physical and chemical property data is available from the following TRC products:

References

Schmidt and Schoeller, 1941
Schmidt, A.W.; Schoeller, V., Physical data of p-alkyl toluenes., Ber. Dtsch. Chem. Ges. A, 1941, 74, 258. [all data]