5-Chloro-2,4-diisocyanato-1-methylbenzene

Phase change data

Data compiled by: William E. Acree, Jr., James S. Chickos

Enthalpy of vaporization

ΔvapH (kcal/mol) Temperature (K) Method Reference Comment
15.9388.AStephenson and Malanowski, 1987Based on data from 373. - 433. K.
14.4 ± 0.05403.N/AStrepikheev, Novikova, et al., 1972Based on data from 373. - 433. K.

References

Stephenson and Malanowski, 1987
Stephenson, Richard M.; Malanowski, Stanislaw, Handbook of the Thermodynamics of Organic Compounds, 1987, https://doi.org/10.1007/978-94-009-3173-2 . [all data]

Strepikheev, Novikova, et al., 1972
Strepikheev, Yu.A.; Novikova, O.P.; Chimishkyan, A.L., Khim. Prom. (Moscow), 1972, 48, 3, 230. [all data]