potassium cyanide

Gas phase thermochemistry data

Quantity Value Units Method Reference Comment
Δfgas79.50kJ/molReviewChase, 1998Data last reviewed in March, 1966
Quantity Value Units Method Reference Comment
gas,1 bar253.15J/mol*KReviewChase, 1998Data last reviewed in March, 1966

Gas Phase Heat Capacity (Shomate Equation)

Cp° = A + B*t + C*t2 + D*t3 + E/t2
H° − H°298.15= A*t + B*t2/2 + C*t3/3 + D*t4/4 − E/t + F − H
S° = A*ln(t) + B*t + C*t2/2 + D*t3/3 − E/(2*t2) + G
    Cp = heat capacity (J/mol*K)
    H° = standard enthalpy (kJ/mol)
    S° = standard entropy (J/mol*K)
    t = temperature (K) / 1000.

View plot Requires a JavaScript / HTML 5 canvas capable browser.

View table.

Temperature (K) 3000. - 6000.
A 61.26590
B 0.509972
C -0.089375
D 0.005515
E -4.709570
F 51.84110
G 315.8810
H 79.49600
ReferenceChase, 1998
Comment Data last reviewed in March, 1966

Condensed phase thermochemistry data

Quantity Value Units Method Reference Comment
Δfliquid-24.892kcal/molReviewChase, 1998Data last reviewed in March, 1966
Quantity Value Units Method Reference Comment
liquid,1 bar32.103cal/mol*KReviewChase, 1998Data last reviewed in March, 1966
Quantity Value Units Method Reference Comment
Δfsolid-27.120kcal/molReviewChase, 1998Data last reviewed in March, 1966
Quantity Value Units Method Reference Comment
solid30.538cal/mol*KReviewChase, 1998Data last reviewed in March, 1966

Liquid Phase Heat Capacity (Shomate Equation)

Cp° = A + B*t + C*t2 + D*t3 + E/t2
H° − H°298.15= A*t + B*t2/2 + C*t3/3 + D*t4/4 − E/t + F − H
S° = A*ln(t) + B*t + C*t2/2 + D*t3/3 − E/(2*t2) + G
    Cp = heat capacity (cal/mol*K)
    H° = standard enthalpy (kcal/mol)
    S° = standard entropy (cal/mol*K)
    t = temperature (K) / 1000.

View plot Requires a JavaScript / HTML 5 canvas capable browser.

View table.

Temperature (K) 895. - 3000.
A 18.00000
B -5.113010×10-11
C 2.953841×10-11
D -5.286439×10-12
E -1.477300×10-12
F -30.25870
G 53.88640
H -24.89199
ReferenceChase, 1998
Comment Data last reviewed in March, 1966

Solid Phase Heat Capacity (Shomate Equation)

Cp° = A + B*t + C*t2 + D*t3 + E/t2
H° − H°298.15= A*t + B*t2/2 + C*t3/3 + D*t4/4 − E/t + F − H
S° = A*ln(t) + B*t + C*t2/2 + D*t3/3 − E/(2*t2) + G
    Cp = heat capacity (cal/mol*K)
    H° = standard enthalpy (kcal/mol)
    S° = standard entropy (cal/mol*K)
    t = temperature (K) / 1000.

View plot Requires a JavaScript / HTML 5 canvas capable browser.

View table.

Temperature (K) 298. - 895.
A 15.72790
B 0.258852
C -0.111004
D 0.024751
E 0.006273
F -31.79931
G 49.53449
H -27.12001
ReferenceChase, 1998
Comment Data last reviewed in March, 1966

Gas phase ion energetics data

Data compiled by: Sharon G. Lias, Rhoda D. Levin, and Sherif A. Kafafi

Ionization energy determinations

IE (eV) Method Reference
9.3 ± 0.3EISimmons, Lowden, et al., 1977

References

Chase, 1998
Chase, M.W., Jr., NIST-JANAF Themochemical Tables, Fourth Edition, J. Phys. Chem. Ref. Data, Monograph 9, 1998, 1-1951. [all data]