1,5,5-trihydrooctafluoropentanol

Phase change data

Data compiled by: Thermodynamics Research Center, NIST Boulder Laboratories, Chris Muzny director

Quantity Value Units Method Reference Comment
Tc571.KN/ASinicyn, Mikhalevich, et al., 1990Uncertainty assigned by TRC = 0.5 K

In addition to the Thermodynamics Research Center (TRC) data available from this site, much more physical and chemical property data is available from the following TRC products:

References

Sinicyn, Mikhalevich, et al., 1990
Sinicyn, E.N.; Mikhalevich, L.A.; Yankovskaya, O.P., Thermodynamic properties of 1,3,3-trihydrotetrafluoropropanol etc., Deposited Doc. VINITI, 1990, Doc. No. 2510-V90, 1990 1990. [all data]