CAS Reg. No. 151247-64-2

Reaction thermochemistry data

Data compiled by: John E. Bartmess

Individual Reactions

(CAS Reg. No. 151247-64-2 • 4294967295platinum) + platinum = CAS Reg. No. 151247-64-2

By formula: (CAS Reg. No. 151247-64-2 • 4294967295Pt) + Pt = CAS Reg. No. 151247-64-2

Quantity Value Units Method Reference Comment
Δr99.2 ± 6.9kcal/molN/AGrushow and Ervin, 1997gas phase

References

Grushow and Ervin, 1997
Grushow, A.; Ervin, K.M., Ligand and Metal Binding Energies in Platinum Carbonyl Cluster Anions: Collision Induced Dissociation of PtM- and Ptm(CO)n-, J. Chem. Phys., 1997, 106, 23, 9580, https://doi.org/10.1063/1.474116 . [all data]