Ga2Sb

Vibrational and/or electronic energy levels

Data compiled by: Marilyn E. Jacox

State:   X

Vib.
sym.
 No.   Approximate
 type of mode
 cm-1   Med.   Method   References

b2 3 Asym. stretch 167.4 Ar IR Li, Van Zee, et al., 1993
Li, Van Zee, et al., 1993

Additional references: Jacox, 1998, page 165

References

Li, Van Zee, et al., 1993
Li, S.; Van Zee, R.J.; Weltner, W., Jr., Far-infrared spectra of small gallium phosphide, arsenide, and antimonide molecules in rare-gas matrixes at 4 K, J. Phys. Chem., 1993, 97, 44, 11393, https://doi.org/10.1021/j100146a009 . [all data]

Jacox, 1998
Jacox, M.E., Vibrational and electronic energy levels of polyatomic transient molecules: supplement A, J. Phys. Chem. Ref. Data, 1998, 27, 2, 115-393, https://doi.org/10.1063/1.556017 . [all data]