Amidogen-d2

Gas phase ion energetics data

Data compiled by: Sharon G. Lias, Rhoda D. Levin, and Sherif A. Kafafi

Ionization energy determinations

IE (eV) Method Reference
11.45 ± 0.01PEDunlavey, Dyke, et al., 1980

References

Dunlavey, Dyke, et al., 1980
Dunlavey, S.J.; Dyke, J.M.; Jonathan, N.; Morris, A., Vacuum ultraviolet photoelectron spectroscopy of transient species. Part 11. The NH2(X(2)B1) radical, Mol. Phys., 1980, 39, 1121. [all data]