p-Mentha-1,8-dien-7-yl acetate

Normal alkane RI, non-polar column, temperature ramp

Data compiled by: NIST Mass Spectrometry Data Center, William E. Wallace, director

Column type CapillaryCapillaryCapillary
Active phase CP Sil 5 CBDB-1DB-1
Column length (m) 30.60.60.
Carrier gas N2
Substrate
Column diameter (mm) 0.250.250.25
Phase thickness (μm) 0.250.250.25
Tstart (C) 50.70.70.
Tend (C) 200.230.230.
Heat rate (K/min) 5.2.2.
Initial hold (min)  2.2.
Final hold (min)  20.20.
I 1421.1405.1406.
ReferenceHnawia, Cabalion, et al., 2007Lan Phi N.T., Nishiyama C., et al., 2006Lan Phi N.T., Nishiyama C., et al., 2006
Comment MSDC-RI MSDC-RI MSDC-RI

Kovats' RI, polar column, temperature ramp

Data compiled by: NIST Mass Spectrometry Data Center, William E. Wallace, director

Column type Capillary
Active phase DB-Wax
Column length (m) 60.
Carrier gas He
Substrate
Column diameter (mm) 0.25
Phase thickness (μm)
Tstart (C) 40.
Tend (C) 200.
Heat rate (K/min) 2.
Initial hold (min) 2.
Final hold (min)
I 1900.
ReferenceUmano, Hagi, et al., 1994
Comment MSDC-RI

Van Den Dool and Kratz RI, non-polar column, custom temperature program

Data compiled by: NIST Mass Spectrometry Data Center, William E. Wallace, director

Column type Capillary
Active phase HP-5MS
Column length (m) 30.
Carrier gas He
Substrate
Column diameter (mm) 0.25
Phase thickness (μm) 0.25
Program 60C (1 min) => 5 C/min => 210C => 10 C/min => 280C (15 min)
I 1436.1
ReferenceAndriamaharavo, 2014
Comment MSDC-RI

References

Hnawia, Cabalion, et al., 2007
Hnawia, E.; Cabalion, P.; Raunicher, I.; Waikedre, J.; Patissou, J.; Buchbauer, G.; Menut, C., The leaf essential oil of Murraya crenulata (Turcz.) Oliver from New Caledonia, Flavour Fragr. J., 2007, 22, 1, 32-34, https://doi.org/10.1002/ffj.1745 . [all data]

Lan Phi N.T., Nishiyama C., et al., 2006
Lan Phi N.T.; Nishiyama C.; Choi H.-S.; Sawamura M., Evaluation of aroma characteristic compounds of Citrus natsudaidai Hayata (Natsudaidai) cold-pressed peel oil, Biosci. Biotechnol. Biochem., 2006, 70, 8, 1832-1838, https://doi.org/10.1271/bbb.50705 . [all data]