C7H8O2S

Reaction thermochemistry data

Data compiled by: John E. Bartmess

Individual Reactions

C7H7O2S- + Hydrogen cation = C7H8O2S

By formula: C7H7O2S- + H+ = C7H8O2S

Quantity Value Units Method Reference Comment
Δr1427. ± 8.8kJ/molG+TSFujio, McIver, et al., 1981gas phase; value altered from reference due to change in acidity scale
Quantity Value Units Method Reference Comment
Δr1399. ± 8.4kJ/molIMREFujio, McIver, et al., 1981gas phase; value altered from reference due to change in acidity scale

Gas phase ion energetics data

Data compiled by: John E. Bartmess

De-protonation reactions

C7H7O2S- + Hydrogen cation = C7H8O2S

By formula: C7H7O2S- + H+ = C7H8O2S

Quantity Value Units Method Reference Comment
Δr341.1 ± 2.1kcal/molG+TSFujio, McIver, et al., 1981gas phase; value altered from reference due to change in acidity scale
Quantity Value Units Method Reference Comment
Δr334.3 ± 2.0kcal/molIMREFujio, McIver, et al., 1981gas phase; value altered from reference due to change in acidity scale

References

Fujio, McIver, et al., 1981
Fujio, M.; McIver, R.T., Jr.; Taft, R.W., Effects on the acidities of phenols from specific substituent-solvent interactions. Inherent substituent parameters from gas phase acidities, J. Am. Chem. Soc., 1981, 103, 4017. [all data]