CAS Reg. No. 15092-81-6

Reaction thermochemistry data

Data compiled by: John E. Bartmess

Individual Reactions

CAS Reg. No. 15092-81-6 + 2Water = H4O10S2-2

By formula: CAS Reg. No. 15092-81-6 + 2H2O = H4O10S2-2

Quantity Value Units Method Reference Comment
Δr8.50 ± 0.30kcal/molTDAsBlades, Klassen, et al., 1995gas phase

References

Blades, Klassen, et al., 1995
Blades, A.T.; Klassen, J.S.; Kebarle, P., Free Energies of Hydration in the Gas Phase on the Anions of Some Oxo Acids of C, N, S, P, Cl and I, J. Am. Chem. Soc., 1995, 117, 42, 10563, https://doi.org/10.1021/ja00147a019 . [all data]