trans-1-Methyl-1,2-dicyclopropylcyclopropane

Gas phase thermochemistry data

Data compiled by: Hussein Y. Afeefy, Joel F. Liebman, and Stephen E. Stein

Quantity Value Units Method Reference Comment
Δfgas179.2 ± 1.2kJ/molCcbPimenova, Kozina, et al., 1993

Phase change data

Data compiled by: Hussein Y. Afeefy, Joel F. Liebman, and Stephen E. Stein

Quantity Value Units Method Reference Comment
Δvap11.3kcal/molEPimenova, Kozina, et al., 1993

References

Pimenova, Kozina, et al., 1993
Pimenova, S.M.; Kozina, M.P.; Kolesov, V.P., The enthalpies of combustion and formation of cis- and trans-1-methyl-1,2-dicyclopropylcyclopropane, Thermochim. Acta, 1993, 221, 139-141. [all data]