CAS Reg. No. 15065-65-3

Reaction thermochemistry data

Data compiled by: John E. Bartmess

Individual Reactions

(CAS Reg. No. 15065-65-3 • 4294967295Oxygen, atomic) + Oxygen, atomic = CAS Reg. No. 15065-65-3

By formula: (CAS Reg. No. 15065-65-3 • 4294967295O) + O = CAS Reg. No. 15065-65-3

Quantity Value Units Method Reference Comment
Δr40.19kcal/molN/AGilles, Polak, et al., 1991gas phase

References

Gilles, Polak, et al., 1991
Gilles, M.K.; Polak, M.L.; Lineberger, W.C., Photoelectron Spectroscopy of IO-, J. Chem. Phys., 1991, 95, 6, 4723, https://doi.org/10.1063/1.461746 . [all data]