InH3

Vibrational and/or electronic energy levels

Data compiled by: Marilyn E. Jacox

State:   X

Vib.
sym.
 No.   Approximate
 type of mode
 cm-1   Med.   Method   References

a2 2 OPLA 613.2 m Ar IR Pullumbi, Bouteiller, et al., 1994
2 OPLA 615.3 H2 IR Wang and Andrews, 2004
e' 3 InH3 stretch 1766 Ne IR Wang and Andrews, 2004
3 InH3 stretch 1754.5 vs Ar IR Pullumbi, Bouteiller, et al., 1994
3 InH3 stretch 1760.9 vs H2 IR Andrews and Wang, 2004
Wang and Andrews, 2004
4 Deformation 607.8 s Ar IR Pullumbi, Bouteiller, et al., 1994
4 Deformation 609.1 H2 IR Wang and Andrews, 2004

Additional references: Jacox, 1998, page 213

References

Pullumbi, Bouteiller, et al., 1994
Pullumbi, P.; Bouteiller, Y.; Manceron, L.; Mijoule, C., Aluminium, gallium and indium trihydrides. an IR matrix isolation and ab initio study, Chem. Phys., 1994, 185, 1, 25, https://doi.org/10.1016/0301-0104(94)00111-1 . [all data]

Wang and Andrews, 2004
Wang, X.; Andrews, L., Infrared Spectra of Indium Hydrides in Solid Hydrogen and Neon, J. Phys. Chem. A, 2004, 108, 20, 4440, https://doi.org/10.1021/jp037942l . [all data]

Andrews and Wang, 2004
Andrews, L.; Wang, X., Infrared Spectra of Indium Hydrides in Solid Hydrogen and of Solid Indane, Angew. Chem. Int. Ed., 2004, 43, 13, 1706, https://doi.org/10.1002/anie.200353216 . [all data]

Jacox, 1998
Jacox, M.E., Vibrational and electronic energy levels of polyatomic transient molecules: supplement A, J. Phys. Chem. Ref. Data, 1998, 27, 2, 115-393, https://doi.org/10.1063/1.556017 . [all data]