8-tert-butyltheophylline

Phase change data

Data compiled as indicated in comments:
TRC - Thermodynamics Research Center, NIST Boulder Laboratories, Chris Muzny director
AC - William E. Acree, Jr., James S. Chickos

Quantity Value Units Method Reference Comment
Tfus402.3KN/AGondova, Kralik, et al., 1989Crystal phase 1 phase; Uncertainty assigned by TRC = 0.1 K; TRC

Enthalpy of fusion

ΔfusH (kcal/mol) Temperature (K) Method Reference Comment
11.5402.3DSCGondová, Králik, et al., 1989AC

In addition to the Thermodynamics Research Center (TRC) data available from this site, much more physical and chemical property data is available from the following TRC products:

References

Gondova, Kralik, et al., 1989
Gondova, T.; Kralik, P.; Gonda, J., Determination of some thermodynamic characteristics of melting of 8-alkyltheophyllines by the DSC method, Thermochim. Acta, 1989, 156, 1, 147, https://doi.org/10.1016/0040-6031(89)87180-1 . [all data]

Gondová, Králik, et al., 1989
Gondová, T.; Králik, P.; Gonda, J., Determination of some thermodynamic characteristics of melting of 8-alkyltheophyllines by the DSC method, Thermochimica Acta, 1989, 156, 1, 147-155, https://doi.org/10.1016/0040-6031(89)87180-1 . [all data]