1,2,3,5,8-Pentachloronaphthalene

Phase change data

Data compiled by: William E. Acree, Jr., James S. Chickos

Enthalpy of vaporization

ΔvapH (kJ/mol) Temperature (K) Method Reference Comment
80.5373.GCLei, Wania, et al., 1999Based on data from 323. - 423. K.

Enthalpy of fusion

ΔfusH (kJ/mol) Temperature (K) Method Reference
8.44453.3DSCLahtinen, Paasivirta, et al., 2006

References

Lei, Wania, et al., 1999
Lei, Ying Duan; Wania, Frank; Shiu, Wan Ying, Vapor Pressures of the Polychlorinated Naphthalenes, J. Chem. Eng. Data, 1999, 44, 3, 577-582, https://doi.org/10.1021/je9802827 . [all data]

Lahtinen, Paasivirta, et al., 2006
Lahtinen, M.; Paasivirta, J.; Nikiforov, V.A., Evaluation of entropies of fusion of polychlorinated naphthalenes by model congeners: A DSC study, Thermochimica Acta, 2006, 447, 1, 5-12, https://doi.org/10.1016/j.tca.2006.04.011 . [all data]