1,2,3,7,8-Pentachloronaphthalene

Phase change data

Data compiled by: William E. Acree, Jr., James S. Chickos

Enthalpy of fusion

ΔfusH (kcal/mol) Temperature (K) Method Reference
4.195381.6DSCLahtinen, Paasivirta, et al., 2006

References

Lahtinen, Paasivirta, et al., 2006
Lahtinen, M.; Paasivirta, J.; Nikiforov, V.A., Evaluation of entropies of fusion of polychlorinated naphthalenes by model congeners: A DSC study, Thermochimica Acta, 2006, 447, 1, 5-12, https://doi.org/10.1016/j.tca.2006.04.011 . [all data]