CAS Reg. No. 14996-02-2

Reaction thermochemistry data

Data compiled by: John E. Bartmess

Individual Reactions

(CAS Reg. No. 14996-02-2 • 4294967295sulphur trioxide) + sulphur trioxide = CAS Reg. No. 14996-02-2

By formula: (CAS Reg. No. 14996-02-2 • 4294967295O3S) + O3S = CAS Reg. No. 14996-02-2

Quantity Value Units Method Reference Comment
Δr433. ± 23.kJ/molN/AWang, Nicholas, et al., 2000gas phase; Lit BDE seems too weak. This plus Viggiano, Henchman, et al., 1992 gives BDE=106

References

Wang, Nicholas, et al., 2000
Wang, X.B.; Nicholas, J.B.; Wang, L.S., Photoelectron spectroscopy and theoretical calculations of SO4- and HSO4-: Confirmation of high electron affinities of SO4 and HSO4, J. Phys. Chem. A, 2000, 104, 3, 504-508, https://doi.org/10.1021/jp992726r . [all data]

Viggiano, Henchman, et al., 1992
Viggiano, A.A.; Henchman, M.J.; Dale, F.; Deakyne, C.A.; Paulson, J.F., Gas-Phase Reactions of Weak Bronsted Bases I-, PO3-, HSO4-, FSO3-, and CF3SO3- with Strong Bronsted Acids H2SO4, FSO3H, and CF3SO3H - A Quantitative Study, J. Am. Chem. Soc., 1992, 114, 11, 4299, https://doi.org/10.1021/ja00037a039 . [all data]