Magnesium chloride

Constants of diatomic molecules

Data compiled by: Klaus P. Huber and Gerhard H. Herzberg

Data collected through March, 1977

Symbols used in the table of constants
SymbolMeaning
State electronic state and / or symmetry symbol
Te minimum electronic energy (cm-1)
ωe vibrational constant – first term (cm-1)
ωexe vibrational constant – second term (cm-1)
ωeye vibrational constant – third term (cm-1)
Be rotational constant in equilibrium position (cm-1)
αe rotational constant – first term (cm-1)
γe rotation-vibration interaction constant (cm-1)
De centrifugal distortion constant (cm-1)
βe rotational constant – first term, centrifugal force (cm-1)
re internuclear distance (Å)
Trans. observed transition(s) corresponding to electronic state
ν00 position of 0-0 band (units noted in table)
Diatomic constants for 24Mg35Cl
StateTeωeωexeωeyeBeαeγeDeβereTrans.ν00
Fragments of four band systems at 12700 Querbach, 1930, 25900 Parker, 1935, 37060 and 40850 cm-1 [ Harrington, 1942, abs.].
B 2Σ 47630 [552.0] H         B → A V 21136.8 H
Rao and Rao, 1963
            21191.9 1 H
Rao and Rao, 1963
A 2Π (1/2) 26523.4 491.6 H 2.54 -0.025 [0.25116] (0.0018)  0.225E-6  [2.1720] A ↔ X 2 V 26535.89 Z
Morgan, 1936; Morgan and Barrow, 1961
StateTeωeωexeωeyeBeαeγeDeβereTrans.ν00
A 2Π (3/2) 26469.4    [0.24914] 3 (0.0018)  0.225E-6  [2.1808] A ↔ X 2 V 26481.95 Z
Morgan, 1936; Morgan and Barrow, 1961
X 2Σ+ 0 [462.12] Z 2.10  0.24502 0.00158  0.252E-6  2.1991

Gas phase thermochemistry data

Quantity Value Units Method Reference Comment
Δfgas-10.40kcal/molReviewChase, 1998Data last reviewed in March, 1966
Quantity Value Units Method Reference Comment
gas,1 bar55.784cal/mol*KReviewChase, 1998Data last reviewed in March, 1966

Gas Phase Heat Capacity (Shomate Equation)

Cp° = A + B*t + C*t2 + D*t3 + E/t2
H° − H°298.15= A*t + B*t2/2 + C*t3/3 + D*t4/4 − E/t + F − H
S° = A*ln(t) + B*t + C*t2/2 + D*t3/3 − E/(2*t2) + G
    Cp = heat capacity (cal/mol*K)
    H° = standard enthalpy (kcal/mol)
    S° = standard entropy (cal/mol*K)
    t = temperature (K) / 1000.

View plot Requires a JavaScript / HTML 5 canvas capable browser.

View table.

Temperature (K) 298. - 6000.
A 8.876631
B 0.168826
C -0.015187
D 0.001296
E -0.054469
F -13.23670
G 66.17070
H -10.40010
ReferenceChase, 1998
Comment Data last reviewed in March, 1966

Gas phase ion energetics data

Data compiled as indicated in comments:
RDSH - Henry M. Rosenstock, Keith Draxl, Bruce W. Steiner, and John T. Herron
B - John E. Bartmess

Electron affinity determinations

EA (eV) Method Reference Comment
1.589 ± 0.011LPESMiller and Lineberger, 1988B

Ionization energy determinations

IE (eV) Method Reference Comment
7.49 ± 0.10EIHildenbrand, 1970RDSH
7.5 ± 0.5EIHildenbrand, 1970, 2RDSH

References

Querbach, 1930
Querbach, J., Uber die spektra von Fe, La, Ca, Ba, Sr, Mg und ihrer verbindungen im nahen ultrarot, Z. Phys., 1930, 60, 109. [all data]

Parker, 1935
Parker, A.E., Band systems of MgCl, CaCl, and SrCl, Phys. Rev., 1935, 47, 349. [all data]

Harrington, 1942
Harrington, Dissertation, University of California, California, 1942, 0. [all data]

Rao and Rao, 1963
Rao, V.S.; Rao, P.T., Emission spectrum of MgCl: a new doublet system, Indian J. Phys., 1963, 37, 640. [all data]

Morgan, 1936
Morgan, F., Band spectra of MgCl, MgBr and MgI in absorption, Phys. Rev., 1936, 50, 603. [all data]

Morgan and Barrow, 1961
Morgan, E.; Barrow, R.F., Rotational analysis of the A2Π-X2Σ+ system of MgCl, Nature (London), 1961, 192, 1182. [all data]

Patel and Patel, 1968
Patel, M.M.; Patel, P.D., 2Π1/2 rotational analysis of the A2Π1/2 → X2Σ+ system of the MgCl molecule, Indian J. Phys., 1968, 42, 254. [all data]

Hildenbrand, 1970
Hildenbrand, D.L., Dissociation energies and chemical bonding in the alkaline-earth chlorides from mass spectrometric studies, J. Chem. Phys., 1970, 52, 5751. [all data]

Farber and Srivastava, 1976
Farber, M.; Srivastava, R.D., The dissociation energy of magnesium chloride, Chem. Phys. Lett., 1976, 42, 567. [all data]