Diazene-d2

Gas phase ion energetics data

Data compiled by: Sharon G. Lias, Rhoda D. Levin, and Sherif A. Kafafi

Ionization energy determinations

IE (eV) Method Reference
9.61PEFrost, Lee, et al., 1975

References

Frost, Lee, et al., 1975
Frost, D.C.; Lee, S.T.; McDowell, C.A.; Westwood, N.P.C., The photoelectron spectrum of diazene (diimine), Chem. Phys. Lett., 1975, 30, 26. [all data]