FN3

Vibrational and/or electronic energy levels

Data compiled by: Marilyn E. Jacox

State:   X

Vib.
sym.
 No.   Approximate
 type of mode
 cm-1   Med.   Method   References

a' 1 NN stretch 2037.0 vs gas IR Christen, Mack, et al., 1988
1 NN stretch 2031.0 Ar IR Milligan and Jacox, 1964
Christen, Mack, et al., 1988
2 N=N stretch 1090.0 m gas IR Christen, Mack, et al., 1988
2 N=N stretch 1085.6 Ar IR Milligan and Jacox, 1964
Christen, Mack, et al., 1988
3 NF stretch 873.5 s gas IR Christen, Mack, et al., 1988
3 NF stretch 868.1 Ar IR Milligan and Jacox, 1964
Christen, Mack, et al., 1988
4 Deform. 658.0 m gas IR Christen, Mack, et al., 1988
4 Deform. 652.1 Ar IR Milligan and Jacox, 1964
Christen, Mack, et al., 1988
5 Deform. 241.0 m gas IR Christen, Mack, et al., 1988
5 Deform. 239.9 Ar IR Christen, Mack, et al., 1988
a 6 Deform. 504.0 w gas IR Christen, Mack, et al., 1988
6 Deform. 502.8 Ar IR Milligan and Jacox, 1964
Christen, Mack, et al., 1988

Additional references: Jacox, 1994, page 199

References

Christen, Mack, et al., 1988
Christen, D.; Mack, H.G.; Schatte, G.; Willner, H., Structure of triazadienyl fluoride, FN3, by microwave, infrared, and ab initio methods, J. Am. Chem. Soc., 1988, 110, 3, 707, https://doi.org/10.1021/ja00211a007 . [all data]

Milligan and Jacox, 1964
Milligan, D.E.; Jacox, M.E., Infrared Spectra of NF, NCl, and NBr, J. Chem. Phys., 1964, 40, 9, 2461, https://doi.org/10.1063/1.1725547 . [all data]

Jacox, 1994
Jacox, M.E., Vibrational and electronic energy levels of polyatomic transient molecules, American Chemical Society, Washington, DC, 1994, 464. [all data]