Phosphoramidothioic dichloride, dimethyl-

Gas phase ion energetics data

Data compiled by: Sharon G. Lias, Rhoda D. Levin, and Sherif A. Kafafi

Ionization energy determinations

IE (eV) Method Reference Comment
8.97 ± 0.04PEVilesov, Lopatin, et al., 1974
8.97 ± 0.003PEVovna, Lopatin, et al., 1973
9.35PEZverev, Vilesov, et al., 1975Vertical value

References

Vilesov, Lopatin, et al., 1974
Vilesov, F.I.; Lopatin, S.N.; Vovna, V.I.; Paetzold, R.; Niendorf, K., Untersuchungen an molekulkomplexen. 3. Mitteilung: Zusammenhang zwischen der ionisierungsenergie von R1R2R3PS-molekulen und der stabilitat ihrer molekulkomplexe mit jod, Z. Phys. Chem. (Leipzig), 1974, 255, 661. [all data]

Vovna, Lopatin, et al., 1973
Vovna, V.I.; Lopatin, S.N.; Pettsold, R.; Vilesov, F.I.; Akopyan, M.E., Photoelectron spectra of thiophosphorylchloride and some of its aminosubstituted derivatives, Opt. Spectrosc., 1973, 34, 501, In original 868. [all data]

Zverev, Vilesov, et al., 1975
Zverev, V.V.; Vilesov, F.I.; Vovna, V.I.; Lopatin, S.N.; Kitaev, Y.P., Photoelectron spectra, Izv. Akad. Nauk SSSR, Ser. Khim., 1975, 1975, 1051. [all data]