bis(8-hydroxyquinolinato)lead(II)

Phase change data

Data compiled by: William E. Acree, Jr., James S. Chickos

Quantity Value Units Method Reference Comment
Δsub44.7 ± 1.5kcal/molMEda Silva, Matos, et al., 1994

References

da Silva, Matos, et al., 1994
da Silva, M.A.V. Ribeiro; Matos, M. Agostinha R.; Gonçalves, J.M.; Johnson, P.M.; Pilcher, G.; Burkinshaw, P.M.; Mortimer, C.T., Standard enthalpies of formation and sublimation of some crystalline bis(8-hydroxyquinolate) metal complexes, Thermochimica Acta, 1994, 247, 2, 245-263, https://doi.org/10.1016/0040-6031(94)80125-8 . [all data]